EHRI Authority list of Events which are related to the Holocaust
date: 2012-02-12
subject: Holocaust research
type: ConceptScheme
description: This Authority list of Events consists of 76 events, expressed as concepts and as Simple Event Model (SEM) resources. The specification of the SEM ontology can be found here: "http://semanticweb.cs.vu.nl/2009/11/sem/semdoc.html"
modified: 2015-02-02
publisher: EHRI (European Holocaust Research Infrastructure)
creator: Yad Vashem
language: en
rights: EHRI (European Holocaust Research Infrastructure)

"Blut für Ware", 1944
type: Event
type: Concept
comment: A proposal that the Nazis would release up to one million Jews in exchange for 10,000 trucks and other goods from the Western Allies.
has time: 1944
event type: tema-1073
broad match: tema-1073
alternative label: "Blood for goods"
alternative label: Blood for goods
has actor: Organization
has place: http://sws.geonames.org/3017382
in scheme: EHRI Authority list of Events which are related to the Holocaust

"Teheran Children", 1942-1943
type: Event
type: Concept
comment: Aliya (emigration to Palestine)
has time: 1942/1943
event type: tema-866
broad match: tema-866
in scheme: EHRI Authority list of Events which are related to the Holocaust

Aktion 1005
type: Event
type: Concept
comment: Code name to cover up the murder of millions of people by the Nazis
has time: 1942/1944
broad match: tema-574
has place: http://sws.geonames.org/8354411
has place: http://sws.geonames.org/798544
in scheme: EHRI Authority list of Events which are related to the Holocaust

Aktion Reinhard, 1942-1943
type: Event
type: Concept
comment: Mass murder of Jews in death camps in Poland
has time: 1942/1943
event type: tema-536
broad match: tema-349
has sub event: Erntefest, 1943
has place: http://sws.geonames.org/798544
has actor: entity
has place: http://data.ehri-project.eu/ehri-camps.rdf#2032
has place: http://data.ehri-project.eu/ehri-camps.rdf#2031
has place: http://data.ehri-project.eu/ehri-camps.rdf#41
in scheme: EHRI Authority list of Events which are related to the Holocaust

Aktion T4
type: Event
type: Concept
comment: A code name to the Nazi euthanasia program to eliminate mentally sick and disabled people
has time: 1939-09/1941-08
event type: tema-377
broad match: tema-377
has place: http://sws.geonames.org/2921044
has actor: entity
related match: tema-320
related match: tema-532
in scheme: EHRI Authority list of Events which are related to the Holocaust

Aliya Bet
type: Event
type: Concept
comment: Illegal Jewish immigration to Eretz Israel during the British Mandate
has time: 1934/1948
event type: tema-866
broad match: tema-866
broad match: tema-214
has place: http://sws.geonames.org/6254930
in scheme: EHRI Authority list of Events which are related to the Holocaust

Annexation of the Sudetenland region to Germany, 1938
type: Event
type: Concept
has time: 1938
event type: tema-1041
broad match: tema-1041
has place: http://sws.geonames.org/2921044
has place: http://sws.geonames.org/3077311
in scheme: EHRI Authority list of Events which are related to the Holocaust

Anschluss [annexation], 1938
type: Event
type: Concept
comment: Annexation of Austria into Nazi Germany in 1938
has time: 1938
event type: tema-1041
broad match: tema-1041
has place: http://sws.geonames.org/2782113
has place: http://sws.geonames.org/2921044
in scheme: EHRI Authority list of Events which are related to the Holocaust

Auschwitz protocols, 1944
type: Event
type: Concept
comment: Two reports about the mass murders taking place at Auschwitz based on information provided by four escapees from the camp in 1944.
has time: 1944
broad match: tema-268
has place: http://data.ehri-project.eu/ehri-camps.rdf#0
in scheme: EHRI Authority list of Events which are related to the Holocaust

Auschwitz Trial in Frankfurt, 1963-1967
type: Event
type: Concept
comment: series of trials running from December 20, 1963 to August 19, 1965, charging 22 defendants under German penal law for their roles in the Holocaust as officials in the Auschwitz-Birkenau. (Dbpedia)
has time: 1963/1967
event type: tema-1130
broad match: tema-1130
has place: http://sws.geonames.org/2921044
has place: http://data.ehri-project.eu/ehri-camps.rdf#0
related match: tema-1218
related match: tema-349
related match: tema-477
in scheme: EHRI Authority list of Events which are related to the Holocaust

Babi Yar Masacre, October 1941
type: Event
type: Concept
comment: site of a series of massacres carried out by the Nazis during their campaign against the Soviet Union (Dbpedia)
has time: 1941-10
event type: tema-540
broad match: tema-540
has actor: Organization
has place: http://sws.geonames.org/690791
related match: tema-539
in scheme: EHRI Authority list of Events which are related to the Holocaust

Berlin Olympics, August 1936
type: Event
type: Concept
has time: 1936-08
event type: tema-709
broad match: tema-709
has place: http://sws.geonames.org/2921044
in scheme: EHRI Authority list of Events which are related to the Holocaust

Bermuda Conference, 1943
type: Event
type: Concept
comment: Conference convened by the United States and Great Britain in Bermuda regarding the fate of refugees
has time: 1943
event type: tema-1074
broad match: tema-1074
has place: http://sws.geonames.org/6252001
has place: http://sws.geonames.org/2635167
related match: tema-304
in scheme: EHRI Authority list of Events which are related to the Holocaust

Boycott of 1 April 1933
type: Event
type: Concept
comment: Nazi boycott of Jewish businesses in Germany
has time: 1933-04-01
event type: tema-331
broad match: tema-331
has place: http://sws.geonames.org/2921044
in scheme: EHRI Authority list of Events which are related to the Holocaust

Bricha
type: Event
type: Concept
comment: Organised escape of Jewish survivors from Europe after the war
event type: tema-203
broad match: tema-203
related match: tema-278
in scheme: EHRI Authority list of Events which are related to the Holocaust

Bulgarian invasion of Trakia and Macedonia, 1941
type: Event
type: Concept
has time: 1933-04-01
event type: tema-1101
broad match: tema-1037
has place: http://sws.geonames.org/732800
has place: http://sws.geonames.org/390903
in scheme: EHRI Authority list of Events which are related to the Holocaust

Casablanca conference, 1943
type: Event
type: Concept
comment: Conference held by the Allies in order to plan their European strategy during World War II.
has time: 1943
event type: tema-1074
broad match: tema-1074
related match: tema-1029
in scheme: EHRI Authority list of Events which are related to the Holocaust

Compilation of the "Black Book" of Soviet Jewry
type: Event
type: Concept
comment: Collection of testimonies and reports about the actions of Nazis against Jews in Eastern Europe during the Holocaust by the Jewish Antifascist Committee
has time: 1943/1948
has actor: Organization
has place: http://sws.geonames.org/8354411
has actor: entity
in scheme: EHRI Authority list of Events which are related to the Holocaust

Demjanjuk Trial in Jerusalem, 1987-1993
type: Event
type: Concept
has time: 1987/1993
event type: tema-1130
broad match: tema-1130
has place: http://sws.geonames.org/294640
has actor: entity
has place: http://data.ehri-project.eu/ehri-camps.rdf#2032
related match: tema-1218
related match: tema-349
in scheme: EHRI Authority list of Events which are related to the Holocaust

Eichmann Trial, 1961-1962
type: Event
type: Concept
has time: 1961/1962
event type: tema-1130
broad match: tema-1130
has place: http://sws.geonames.org/294640
has actor: entity
has place: http://data.ehri-project.eu/ehri-camps.rdf#2032
related match: tema-1218
related match: tema-349
in scheme: EHRI Authority list of Events which are related to the Holocaust

Erntefest, 1943
type: Event
type: Concept
comment: Code name for the operation to exterminate the last surviving Jews of the Trawniki, Poniatowa and Majdanek camps.
has time: 1943
broad match: tema-349
has place: http://sws.geonames.org/798544
has place: http://data.ehri-project.eu/ehri-camps.rdf#2032
has place: http://data.ehri-project.eu/ehri-camps.rdf#566
has place: http://data.ehri-project.eu/ehri-camps.rdf#560
in scheme: EHRI Authority list of Events which are related to the Holocaust
broader: Aktion Reinhard, 1942-1943

Europa Plan, 1942-1944
type: Event
type: Concept
comment: Plan devised by the Slovakian working group "Pracovna Skupina" to rescue European Jewry from extermination by paying ransom
has time: 1942/1944
event type: tema-259
broad match: tema-259
related: "Blut für Ware", 1944
alternative label: 0
has actor: Organization
has place: http://sws.geonames.org/719819
in scheme: EHRI Authority list of Events which are related to the Holocaust

Evian Conference, 1938
type: Event
type: Concept
comment: International Conference on acceptance possibilities for Jewish Refugees
has time: 1938
event type: tema-1074
broad match: tema-304
broad match: tema-203
broad match: tema-1074
has place: http://sws.geonames.org/3017382
in scheme: EHRI Authority list of Events which are related to the Holocaust

First World War, 1914-1918
type: Event
type: Concept
comment: Wars
has time: 1914/1918
event type: tema-1080
broad match: tema-1080
related: Treaty of Versailles, June 1919
alternative label: World War I
in scheme: EHRI Authority list of Events which are related to the Holocaust

German invasion of France, Belgium and the Netherlands, 1940
type: Event
type: Concept
comment: German Occupation
has time: 1940
event type: tema-1101
broad match: tema-633
has place: http://sws.geonames.org/2921044
has place: http://sws.geonames.org/3017382
has place: http://sws.geonames.org/2802361
has place: http://sws.geonames.org/2750405
in scheme: EHRI Authority list of Events which are related to the Holocaust

German invasion of Greece, 1941
type: Event
type: Concept
comment: German Occupation
has time: 1941
event type: tema-1101
broad match: tema-633
has place: http://sws.geonames.org/2921044
has place: http://sws.geonames.org/390903
in scheme: EHRI Authority list of Events which are related to the Holocaust

German invasion of Italy, 1943
type: Event
type: Concept
comment: German Occupation
has time: 1943
event type: tema-1101
broad match: tema-633
has place: http://sws.geonames.org/2921044
has place: http://sws.geonames.org/3175395
in scheme: EHRI Authority list of Events which are related to the Holocaust

German invasion of Norway and Denmark, April 1940
type: Event
type: Concept
comment: German Occupation
has time: 1940-04
event type: tema-1101
broad match: tema-633
has place: http://sws.geonames.org/2921044
has place: http://sws.geonames.org/3144096
has place: http://sws.geonames.org/2623032
in scheme: EHRI Authority list of Events which are related to the Holocaust

German invasion of Poland, September 1939
type: Event
type: Concept
comment: German Occupation
has time: 1939-09
event type: tema-1101
broad match: tema-633
alternative label: Polenfeldzug
alternative label: Operation Fall Weiss
has actor: Organization
has place: http://sws.geonames.org/798544
has place: http://sws.geonames.org/2921044
in scheme: EHRI Authority list of Events which are related to the Holocaust
broader: Second World War, 1939-1945

German invasion of Serbia, April 1941
type: Event
type: Concept
comment: German Occupation
has time: 1941-04
event type: tema-1101
broad match: tema-633
has place: http://sws.geonames.org/2921044
has place: http://sws.geonames.org/6290252
in scheme: EHRI Authority list of Events which are related to the Holocaust

German invasion of the USSR, June 1941
type: Event
type: Concept
has time: 1941-06
event type: tema-1101
broad match: tema-633
related: Kommissarbefehl, June 1941
alternative label: Operation Barbarossa
alternative label: Barbarossa
has place: http://sws.geonames.org/8354411
has place: http://sws.geonames.org/2921044
in scheme: EHRI Authority list of Events which are related to the Holocaust

German invasion of Vichy France, November 1942
type: Event
type: Concept
comment: German Occupation
has time: 1942-11
event type: tema-1101
broad match: tema-633
has place: http://sws.geonames.org/2921044
has place: http://sws.geonames.org/3017382
in scheme: EHRI Authority list of Events which are related to the Holocaust

German occupation of Hungary, March 1944
type: Event
type: Concept
comment: German occupation
has time: 1944-03
event type: tema-1101
broad match: tema-633
alternative label: Operation Margarete
alternative label: Margarete
has place: http://sws.geonames.org/719819
has place: http://sws.geonames.org/2921044
in scheme: EHRI Authority list of Events which are related to the Holocaust

Gold train
type: Event
type: Concept
comment: Train with confiscated property, mostly of Hungarian Jews looted by allied forces in Austria in May 1945.
broad match: tema-940
has place: http://sws.geonames.org/719819
has place: http://sws.geonames.org/2782113
related match: tema-887
related match: tema-655
in scheme: EHRI Authority list of Events which are related to the Holocaust

Haavarah-Transfer Agreement
type: Event
type: Concept
comment: An agreement concluded by Nazi Germany and the Jewish Agency allowing Jews immigrating to Palestine to receive property or money in Palestine in exchange for assets left in Germany
event type: tema-866
broad match: tema-866
has place: http://sws.geonames.org/6254930
related match: tema-887
in scheme: EHRI Authority list of Events which are related to the Holocaust

Heydrich Assassination, 1942
type: Event
type: Concept
has time: 1942
event type: term230
broad match: tema-212
has place: http://sws.geonames.org/3339576
has actor: entity
in scheme: EHRI Authority list of Events which are related to the Holocaust

Iasi Pogrom, June-July 1941
type: Event
type: Concept
comment: Pogrom launched by governmental forces in the Romanian city of Iaşi against its Jewish population
has time: 1941-06/1941-07
event type: tema-346
broad match: tema-346
has actor: Organization
has place: http://sws.geonames.org/798549
in scheme: EHRI Authority list of Events which are related to the Holocaust

Italian invasion of France
type: Event
type: Concept
has time: 1940-06
event type: tema-1101
broad match: tema-1035
has place: http://sws.geonames.org/3175395
has place: http://sws.geonames.org/3017382
in scheme: EHRI Authority list of Events which are related to the Holocaust

Italian invasion of Greece
type: Event
type: Concept
event type: tema-1101
broad match: tema-633
has place: http://sws.geonames.org/390903
has place: http://sws.geonames.org/3175395
in scheme: EHRI Authority list of Events which are related to the Holocaust

Italian invasion of Yugoslavia
type: Event
type: Concept
event type: tema-1101
broad match: tema-1035
has place: http://sws.geonames.org/3175395
has place: http://sws.geonames.org/6290252
in scheme: EHRI Authority list of Events which are related to the Holocaust

Jedwabne Pogrom, July 1941
type: Event
type: Concept
comment: Murder of local Jews by their neighbours
has time: 1941-07
event type: tema-346
broad match: tema-346
has place: http://sws.geonames.org/798544
in scheme: EHRI Authority list of Events which are related to the Holocaust

July 20 Plot, July 1944
type: Event
type: Concept
comment: Attempt to assassinate Hitler (July 20, 1944)
has time: 1944-07
event type: tema-184
broad match: tema-184
alternative label: Operation Valkyrie
related match: tema-539
in scheme: EHRI Authority list of Events which are related to the Holocaust

Katyn affair
type: Event
type: Concept
comment: Mass execution of Polish POW officers and citizens by the Soviet authorities in 1940
event type: tema-540
broad match: tema-1036
has place: http://sws.geonames.org/8354411
in scheme: EHRI Authority list of Events which are related to the Holocaust

Katzmann report, June 1943
type: Event
type: Concept
comment: Report on the extermination of Jews in Galicia
has time: 1943-06
broad match: tema-349
has place: http://sws.geonames.org/798544
has place: http://sws.geonames.org/562153
has actor: entity
in scheme: EHRI Authority list of Events which are related to the Holocaust

Kielce pogrom, July 1946
type: Event
type: Concept
comment: Massacre of Jews in Kielce on July 4, 1946 by locals.
has time: 1946-07
event type: tema-346
broad match: tema-1225
broad match: tema-642
has place: http://sws.geonames.org/798544
in scheme: EHRI Authority list of Events which are related to the Holocaust

Kommissarbefehl, June 1941
type: Event
type: Concept
comment: Order given by Adolf Hitler on 6 June 1941, prior to Operation Barbarossa to kill Soviet political commissars
has time: 1941-06
event type: tema-633
broad match: tema-633
has place: http://sws.geonames.org/8354411
has place: http://sws.geonames.org/2921044
related match: tema-532
in scheme: EHRI Authority list of Events which are related to the Holocaust

Kristallnacht Riots, November 1938
type: Event
type: Concept
comment: Riots against the Jewish population all over the Third Reich, sponsored by the authorities
has time: 1938-11-09/1938-11-10
event type: tema-346
broad match: tema-346
broad match: tema-645
broad match: tema-642
alternative label: Night of the Broken Glass
has place: http://sws.geonames.org/2921044
has place: http://sws.geonames.org/2782113
in scheme: EHRI Authority list of Events which are related to the Holocaust

Legionnaires (Iron Guard) revolt, January 1941
type: Event
type: Concept
comment: Revolt of the Iron Guard in Romania during which the guardists killed Jews and soldiers
has time: 1941-01
event type: tema-346
broad match: tema-346
has actor: Organization
has place: http://sws.geonames.org/798549
in scheme: EHRI Authority list of Events which are related to the Holocaust

Munich Conference
type: Event
type: Concept
comment: Conference held in Munich on September 28-29, 1938, during which the leaders of Great Britain, France, and Italy agreed to allow Germany to annex certain areas of Czechoslovakia.
event type: tema-1074
broad match: tema-1041
alternative label: Munich agreement
alternative label: Munich pact
has place: http://sws.geonames.org/2921044
has actor: entity
in scheme: EHRI Authority list of Events which are related to the Holocaust

Nacht und Nebel Erlass, December 1941
type: Event
type: Concept
comment: A German order that any underground resistance activities against the Reich carried out in Western Europe would be punished in the most severe ways.
has time: 1941-12
broad match: tema-649
alternative label: Night and Fog decree
has actor: entity
in scheme: EHRI Authority list of Events which are related to the Holocaust

Nuremberg laws, 1935
type: Event
type: Concept
comment: German laws that became the basis for the further legal exclusion of Jews from German life and the ensuing antiJewish policy.
has time: 1935
event type: tema-335
broad match: tema-335
broad match: tema-952
alternative label: Nuernberger Gesetze
has place: http://sws.geonames.org/2921044
in scheme: EHRI Authority list of Events which are related to the Holocaust

Nuremberg Trials, 1945-1949
type: Event
type: Concept
comment: A series of military tribunals, held by the Allied forces of World War II, for the prosecution of prominent members of the political, military, and economic leadership of the defeated Nazi Germany.
has time: 1945/1949
event type: tema-1130
broad match: tema-1130
has place: http://sws.geonames.org/2921044
related match: tema-1218
in scheme: EHRI Authority list of Events which are related to the Holocaust

Petliura Days, July 1941
type: Event
type: Concept
comment: Riots against the Jews of Lwow, organized by nationalist Ukrainian groups
has time: 1941-07
event type: tema-346
broad match: tema-346
has actor: Organization
has place: http://sws.geonames.org/690791
has place: http://data.ehri-project.eu/ehri-ghettos#501
in scheme: EHRI Authority list of Events which are related to the Holocaust

Potsdam Conference, July-August 1945
type: Event
type: Concept
comment: Conference of Allied leaders to discuss post-war arrangements in Europe
has time: 1945-07/1945-08
has place: http://sws.geonames.org/2921044
has actor: entity
in scheme: EHRI Authority list of Events which are related to the Holocaust

Rafle du Vel d'Hiv, July 1942
type: Event
type: Concept
comment: Mass arrests of foreign Jews at the winter sport stadium in Paris
has time: 1942-07
event type: tema-550
broad match: tema-550
alternative label: Winter sport palace round-up
has actor: Organization
has place: http://sws.geonames.org/3017382
related match: tema-1149
in scheme: EHRI Authority list of Events which are related to the Holocaust

Rescue Operation of Danish Jews, 1943
type: Event
type: Concept
has time: 1943
event type: tema-214
broad match: tema-214
has place: http://sws.geonames.org/2623032
has place: http://sws.geonames.org/2661886
in scheme: EHRI Authority list of Events which are related to the Holocaust

Ribbentrop-Molotov Pact, 1939
type: Event
type: Concept
comment: Mutual non-aggression agreement between Nazi Germany and the Soviet Union. That enabled them to divide Poland between themselves.
has time: 1939
broad match: tema-633
has place: http://sws.geonames.org/798544
has place: http://sws.geonames.org/2921044
has place: http://sws.geonames.org/8354411
has actor: entity
in scheme: EHRI Authority list of Events which are related to the Holocaust

Riegner Cable
type: Event
type: Concept
comment: Transmission of information to the West regarding the annihilation of the Jews by Gerhard Riegner, Head of the Jewish World Congress office in Geneva
broad match: tema-202
has actor: Organization
has actor: entity
in scheme: EHRI Authority list of Events which are related to the Holocaust

Saar region annexed to Germany, 1935
type: Event
type: Concept
has time: 1935
event type: tema-1101
broad match: tema-1041
has place: http://sws.geonames.org/2921044
in scheme: EHRI Authority list of Events which are related to the Holocaust

Second World War, 1939-1945
type: Event
type: Concept
comment: Wars
has time: 1939/1945
event type: tema-1080
broad match: tema-1080
has sub event: V-E Day, Victory in Europe Day, 1945
alternative label: World War II
related match: tema-349
in scheme: EHRI Authority list of Events which are related to the Holocaust

Sending of parachutists from Eretz Israel, 1943-1945
type: Event
type: Concept
comment: Sending a group of Jewish volunteers from Eretz Israel on missions to countries in Nazi-occupied Europe in order to organize Jewish resistance
has time: 1943/1945
event type: tema-259
broad match: tema-259
has place: http://sws.geonames.org/3057568
has place: http://sws.geonames.org/719819
has place: http://sws.geonames.org/6254930
has actor: entity
in scheme: EHRI Authority list of Events which are related to the Holocaust

Slovak National Uprising, 1944
type: Event
type: Concept
has time: 1944-08-29/1944-10-28
event type: tema-254
has place: http://sws.geonames.org/3057568
in scheme: EHRI Authority list of Events which are related to the Holocaust

Sobibor Uprising, 1943
type: Event
type: Concept
comment: Uprisal of camp inmates in the Sobibor camp
has time: 1943-10-14
event type: tema-254
has place: http://sws.geonames.org/798544
has place: http://data.ehri-project.eu/ehri-camps.rdf#2031
in scheme: EHRI Authority list of Events which are related to the Holocaust

Sonderkommando Uprising in Auschwitz, 7 October 1944
type: Event
type: Concept
has time: 1944-10-07
event type: tema-254
has place: http://sws.geonames.org/798544
has place: http://data.ehri-project.eu/ehri-camps.rdf#0
related match: tema-1391
in scheme: EHRI Authority list of Events which are related to the Holocaust

Sperre, September 1942
type: Event
type: Concept
comment: Round up of the old and sick people and the children of the Lodz Ghetto in order to deport them to the Chelmno camp
has time: 1942-09
event type: tema-550
broad match: tema-550
has place: http://sws.geonames.org/798544
has place: http://data.ehri-project.eu/ehri-camps.rdf#2029
has place: http://data.ehri-project.eu/ehri-ghettos#513
related match: tema-518
in scheme: EHRI Authority list of Events which are related to the Holocaust

Strike of February 1941 in Amsterdam
type: Event
type: Concept
comment: Protest against the persecution of Duch Jews
has time: 1941-02
event type: tema-984
has place: http://sws.geonames.org/2750405
in scheme: EHRI Authority list of Events which are related to the Holocaust

Stroop report
type: Event
type: Concept
comment: Report on the oppression of the Warsaw Ghetto Uprising
broad match: tema-349
related: Wannsee Konferenz, 1942
has actor: entity
in scheme: EHRI Authority list of Events which are related to the Holocaust

The Budapest Rescue Committee train, June 1944
type: Event
type: Concept
comment: Train of almost 1,700 Jews who escaped from Hungary to Switzerland
has time: 1944-06
event type: tema-214
broad match: tema-214
alternative label: The Kasztner train
has place: http://sws.geonames.org/719819
has place: http://sws.geonames.org/2658434
has actor: entity
has place: http://data.ehri-project.eu/ehri-camps.rdf#42
in scheme: EHRI Authority list of Events which are related to the Holocaust

Treaty of Versailles, June 1919
type: Event
type: Concept
comment: One of the treaties that ended World War I
has time: 1919-06
has place: http://sws.geonames.org/3017382
in scheme: EHRI Authority list of Events which are related to the Holocaust

Treblinka Uprising, 1943
type: Event
type: Concept
comment: Uprisal of camp inmates in the Treblinka camp
has time: 1943-08-02
event type: tema-254
broad match: tema-254
has place: http://sws.geonames.org/798544
has place: http://data.ehri-project.eu/ehri-camps.rdf#2032
in scheme: EHRI Authority list of Events which are related to the Holocaust

V-E Day, Victory in Europe Day, 1945
type: Event
type: Concept
has time: 1945-05-08
broad match: tema-1029
in scheme: EHRI Authority list of Events which are related to the Holocaust
broader: Second World War, 1939-1945

Vierjahresplan
type: Event
type: Concept
comment: Economic program written in August 1936 for the revitalization of the German army and economy within four years in anticipation of war.
has time: 1936-08
broad match: tema-918
has place: http://sws.geonames.org/2921044
in scheme: EHRI Authority list of Events which are related to the Holocaust

Wannsee Konferenz, 1942
type: Event
type: Concept
comment: Meeting held in Berlin to discuss and coordinate the implementation of the Final Solution of the Jewish Question
has time: 1942
event type: tema-1074
broad match: tema-349
has place: http://sws.geonames.org/2921044
has actor: entity
in scheme: EHRI Authority list of Events which are related to the Holocaust

Warsaw Ghetto Uprising, 1943
type: Event
type: Concept
has time: 1943
event type: tema-254
broad match: tema-254
has place: http://sws.geonames.org/798544
has place: http://data.ehri-project.eu/ehri-ghettos#1106
in scheme: EHRI Authority list of Events which are related to the Holocaust

Warsaw Polish Uprising, 1944
type: Event
type: Concept
has time: 1944
event type: tema-254
broad match: tema-254
has place: http://sws.geonames.org/798544
has place: http://data.ehri-project.eu/ehri-ghettos#1106
in scheme: EHRI Authority list of Events which are related to the Holocaust

Yalta Conference, 1945
type: Event
type: Concept
comment: Conference, held by the three chief Allied leaders, Franklin D. Roosevelt , Winston Churchill Joseph Stalin for the purpose of discussing Europe's post-war reorganization.
has time: 1945
event type: tema-1074
has actor: entity
in scheme: EHRI Authority list of Events which are related to the Holocaust